{"text_format":"3","workbook":"xlsx","n_sheets":9,"sheets":["Bearbeitungshinweise","Unterhaltsberechnung","Schonvermögen","Verrentungstabelle","Rentenlücke","Korrektur der Altersvorsorge","Parametereinstellung","BMF-Tabelle","Sterbetafel"],"not_rendered":{"images":2,"macros":1,"external_links":3,"defined_names":64,"comments":2},"read":"whole","date_system":"1900"}

{"sheet":"Bearbeitungshinweise","index":0,"n_rows":53,"n_cols":10,"rows_kept":53,"merged":[[0,9,1,16],[2,9,2,16],[32,9,32,16],[33,9,33,16],[34,9,34,16],[35,9,35,16],[36,9,36,16],[37,9,37,16],[38,9,38,16],[39,1,40,7],[41,5,41,7],[42,5,42,7],[43,1,43,7],[44,4,44,7],[45,1,45,7],[46,2,46,6],[47,2,47,6],[48,2,48,6],[50,3,50,6],[51,1,51,7],[52,1,52,7]]}
["",{"$nulls":8},"Das Berechnungsblatt Elternunterhalt"]
[]
[{"$nulls":9},"entstanden aus FamRZ-Buch 21, 5. Aufl. 2015"]
[{"$nulls":9},"Das Berechnungsblatt Elternunterhalt ermöglicht dem Anwalt die schnelle Berechnung von Elternunterhalt."]
[{"$nulls":9},"Es wurde die Berechnungsmethode aus der Entscheidung des BGH v. 28.7.2010 - XII ZR 140/07"]
[{"$nulls":9},"als einzige Berechnungsmethode gewählt, weil sich durch diese Entscheidung die übrigen"]
[{"$nulls":9},"Methoden erübrigen."]
[]
[{"$nulls":9},"Die Handhabung des Berechnungsblattes ist denkbar einfach:"]
[{"$nulls":9},"1. Klicken Sie auf den Registereintrag 'Unterhaltsberechnung';"]
[{"$nulls":9},"2. Tragen Sie die Nettoberechnungswerte in die weißen Felder des Berechnungsblattes ein;"]
[{"$nulls":9},"3. Das Feld 'berufsbedingte Aufwendungen' ist vorbelegt mit 5% des Erwerbseinkommens. Diese Vorein-"]
[{"$nulls":9},"   stellung kann einfach überschrieben werden."]
[{"$nulls":9},"4. Lesen Sie das Ergebnis ab und variieren Sie gegebenenfalls die Einträge;"]
[{"$nulls":9},"5. Drucken Sie das Berechnungsblatt aus"]
{"$rows_left_out":39}
{"sheet":"Unterhaltsberechnung","index":1,"n_rows":68,"n_cols":28,"rows_kept":68,"merged":[[0,1,0,3],[0,5,0,15],[1,5,21,5],[10,2,23,2],[10,14,22,14],[22,5,24,5],[28,11,28,12],[39,2,39,3],[39,5,40,5],[39,6,40,6],[39,7,40,7],[39,8,40,8],[39,13,40,13],[40,0,40,3],[40,14,40,15],[41,2,41,3],[41,14,41,15],[42,0,43,3],[42,5,43,15],[44,0,44,3],[49,14,49,15],[50,14,54,15],[56,2,56,3]]}
["Elternunterhaltsberechnung *)",{"$nulls":4},"Berechnung nach OLG Düsseldorf *)",{"$nulls":18},{"v":1,"d":"1.00 €"},{"$f":"IF(Z3=1,3/7,4.5/10)","v":0.42857142857142855},1,{"v":0.1,"d":"10.0%"}]
["Einkommensbereinigung bitte stets Nettobeträge eingeben","U-Pflichtiger",null,"Gatte",null,"Das OLG Düsseldorf hat in einer Entscheidung v. 8.2.07 - II-3 UF 270/05, FamRB 2007, 264 eine von der links wiedergegebenen Entscheidung abweichende Berechnung entwickelt, die ausschließlich für verheiratete Unterhaltspflichtige gilt und in bestimmten Konstellationen deutliche Vorteile für die Unterhaltspflichtigen liefert. Wir bieten diese Methode als Berechnungsergänzung an.Die Methode ist insbesondere dann für die Unterhaltspflichtigen günstiger, wenn deren Einkommen höher ist, als das des Gatten. Die Methode gelangt zu einem ausgewogeneren Unterhaltsprofil.",{"$nulls":7},{"$f":"+B2","v":"U-Pflichtiger"},null,{"$f":"+D2","v":"Gatte"},{"$nulls":9},true,2,{"v":0.125,"d":"12.5%"}]
["Erwerbseinkommen (netto) Rn. 209 ff.",null,{"$f":"+B3+D3","v":{"v":0,"d":"0.00 €"}},{"$nulls":10},{"$f":"+B3","v":{"v":0,"d":"0.00 €"}},null,{"$f":"+D3","v":{"v":0,"d":"0.00 €"}},{"$nulls":4},{"$f":"+#REF!/(#REF!+#REF!)","v":{"$error":"#REF!"}},{"$f":"+#REF!/(#REF!+#REF!)","v":{"$error":"#REF!"}},{"$nulls":3},1,3,{"v":0.14,"d":"14.0%"}]
["Mieteinnahmen (netto) Rn. 254 ff.",{"$nulls":12},{"$f":"+B4","v":{"v":0,"d":"0.00 €"}},null,{"$f":"+D4","v":{"v":0,"d":"0.00 €"}},{"$nulls":9},false,4,{"v":0.25,"d":"25.0%"}]
["Kapitaleinkünfte (nur, wenn Altersvorsorgevermögen überschritten,  Rn. 295 ff.)",{"$nulls":12},{"$f":"+B5","v":{"v":0,"d":"0.00 €"}},null,{"$f":"+D5","v":{"v":0,"d":"0.00 €"}},{"$nulls":11},2]
["Renten (Nettobeträge)",{"$nulls":12},{"v":0,"d":"0.00 €"},null,{"v":0,"d":"0.00 €"},{"$nulls":11},{"$f":"VLOOKUP(AB5,AA1:AB4,2)","v":{"v":0.125,"d":"12.5%"}}]
["Sonstiges",{"$nulls":12},{"v":0,"d":"0.00 €"},null,{"v":0,"d":"0.00 €"}]
["Wohnvorteil, Rn. 263ff.",{"$nulls":12},{"v":0,"d":"0.00 €"},null,{"v":0,"d":"0.00 €"}]
["Steuererstattungen (Nachzahlungen unter Abzüge eintragen) Rn. 299 ff.",{"$nulls":12},{"v":0,"d":"0.00 €"},null,{"v":0,"d":"0.00 €"}]
["Summe der Einkünfte",{"$f":"SUM(B3:B9)","v":{"v":0,"d":"0.00 €"}},{"$f":"+D10+B10","v":0},{"$f":"IF(Z2=TRUE,SUM(D3:D9),0)","v":{"v":0,"d":"0.00 €"}},{"$nulls":9},{"v":0,"d":"0.00 €"},null,{"v":0,"d":"0.00 €"}]
["./. Vermögenswirksame Leistungen",null,"Bitte geben Sie die Werte mit negativem Vorzeichen ein",{"$nulls":10},{"v":0,"d":"0.00 €"},null,{"v":0,"d":"0.00 €"}]
["./. Private Kranken- und Pflegeversicherung, Rn. 404 ff.",{"$nulls":12},{"v":0,"d":"0.00 €"},null,{"v":0,"d":"0.00 €"}]
["./. Berufsbedingte Aufwendungen, 5% d. Erwerbseinkommens, Rn. 469 ff.",{"$nulls":12},{"v":0,"d":"0.00 €"},null,{"v":0,"d":"0.00 €"}]
["./. Immobilienverbindlichkeiten, Rn. 490 ff.",{"$nulls":12},{"v":0,"d":"0.00 €"},null,{"v":0,"d":"0.00 €"}]
["./. Verbraucherdarlehen, Rn. 476 ff.",{"$nulls":12},{"v":0,"d":"0.00 €"},null,{"v":0,"d":"0.00 €"}]
{"$rows_left_out":54}
{"sheet":"Schonvermögen","index":2,"n_rows":51,"n_cols":14,"rows_kept":51,"merged":[[0,1,1,3],[2,6,2,7],[3,6,3,7],[4,6,4,7],[5,6,5,7],[6,6,6,7],[7,6,7,7],[8,6,8,7],[9,6,9,7],[10,6,10,7],[11,6,11,7],[12,2,12,3],[12,6,12,7],[27,1,27,3],[28,1,28,3],[29,1,29,3],[30,1,30,3]]}
[null,"Berechnung des Altersvorsorgeschonvermögens*)"]
[]
[null,null,"Unterhaltspflichtiger","Gatte",1,{"$nulls":6},"Alter","jährl. Versor-gungskapital § 851c ZPO","Summe Versorgungs- kapital"]
[null,"Sozialversicherungspflicht",null,null,true,true,{"$nulls":5},18,2000,{"$f":"+M4","v":2000}]
[null,"Beamter",null,null,false,false,{"$nulls":5},19,2000,{"$f":"+M5+N4","v":4000}]
[null,"Bruttoeinkommen",{"v":100000,"d":"100,000.00 €"},null,true,{"$nulls":6},20,2000,{"$f":"+M6+N5","v":6000}]
[null,"Beitragsbemessungsgrenze",{"$f":"IF(E4=TRUE,CHOOSE($E$3,IF($E$7=FALSE,Parametereinstellung!B14,Parametereinstellung!C14),IF($E$7=FALSE,Parametereinstellung!B27,Parametereinstellung!C27))*IF($E$6=FALSE,1,12),0)","v":{"v":77400,"d":"77,400.00 €"}},{"$f":"IF(F4=TRUE,CHOOSE(E3,IF($E$7=FALSE,Parametereinstellung!B14,Parametereinstellung!C14),IF($E$7=FALSE,Parametereinstellung!B27,Parametereinstellung!C27))*IF($E$6=FALSE,1,12),0)","v":{"v":77400,"d":"77,400.00 €"}},false,{"$nulls":6},21,2000,8000]
[null,"Einkommen > Beitragsbemessungsgrenze",{"$f":"IF(C6>C7,C6-C7,0)","v":{"v":22600,"d":"22,600.00 €"}},{"$f":"IF(D6>D7,D6-D7,0)","v":0},{"$nulls":7},22,2000,10000]
[null,"Alter",50,45,{"$nulls":7},23,2000,12000]
[null,"Erwerbsjahre ab 18. Lebensjahr",{"$f":"+C9-18","v":32},{"$f":"+D9-18","v":27},{"$nulls":7},24,2000,14000]
[null,{"$f":"\"Altersvorsorge: 5% x \" & TEXT(C6,\"#.###,00\") & IF(AND(C8>0,E5=FALSE),\" + 20% x \" &TEXT(C8,\"#.###,00\"),\"\")","v":"Altersvorsorge: 5% x 100.000,00 + 20% x 22.600,00"},{"$f":"IF(E5=TRUE,C6*0.05,C6*0.05+C8*0.2)","v":{"v":9520,"d":"9,520.00 €"}},{"$f":"IF(F5=TRUE,D6*0.05,D6*0.05+D8*0.2)","v":0},{"$nulls":7},25,2000,16000]
[null,{"$f":"\"mit 4% aufgezinster Betrag von \"&TEXT(C11,\"###.##0,00\")&\" über \"&TEXT(C10,\"##\")&\" Jahre =\"","v":"mit 4% aufgezinster Betrag von 9.520,00 über 32 Jahre ="},{"$f":"FV(0.04/IF(E6=FALSE,12,1),C10*IF(E6=TRUE,1,12),-C11)","v":{"v":596917.981749298,"d":"596,917.98 €"}},{"$f":"FV(0.04/IF(E6=FALSE,12,1),D10*IF(E6=TRUE,1,12),-D11)","v":{"v":0,"d":"0.00 €"}},{"$nulls":7},26,2000,18000]
[null,"Summe",{"$f":"+C12+D12","v":{"v":596917.981749298,"d":"596,917.98 €"}},{"$nulls":8},27,2000,20000]
[null,"Schonvermögen nach § 851c ZPO",{"$f":"IF(C9<18,0,VLOOKUP(C9,Tabelle851,3))","v":{"v":118000,"d":"118,000.00 €"}},{"$f":"IF(D9<18,0,VLOOKUP(D9,Tabelle851,3))","v":{"v":91000,"d":"91,000.00 €"}},{"$nulls":7},28,2000,22000]
[{"$nulls":11},29,2000,24000]
{"$rows_left_out":37}
{"sheet":"Verrentungstabelle","index":3,"n_rows":16,"n_cols":8,"rows_kept":16,"merged":[[0,1,0,5],[1,1,1,5],[2,1,2,5],[3,1,3,3],[4,1,4,3],[4,4,4,5],[5,1,5,3],[5,4,5,5],[6,1,6,3],[7,1,7,3],[8,1,8,3],[9,1,9,3],[10,1,10,5],[11,1,11,3],[12,1,12,3],[13,1,13,5],[14,1,14,3],[15,1,15,3]]}
[null,"Verrentungsrechner"]
[null,"Mit dem Verrentungsrechner kann ermittelt werden, in welcher Höhe dem unterhaltspflichtigen Kind durch Verrentung des Schonvermögens ab Rentenalter ein monatlicher Einkommenszuwachs zuzurechnen ist."]
[null,{"$f":"\"Beispiel: M(\"&TEXT(E7,\"##\")&\") hat Vermögen in Höhe von \"&TEXT(E5,\"###.##0 €\")&\". Aus diesem Vermögen kann ihm nach BGH \"&TEXT(E12,\"###.##0 €\")&\" monatliches Einkommen ab Renteneintritt (\"&TEXT(Rentenalter,\"##\")&\") zugerechnet werden. Bei Annahme eines realistischen Rechnungszinses von \"&TEXT(E6,\"##%\")&\" und der aktuellen Sterbetafeln jedoch nur \"&TEXT(E15,\"###.##0 €\")&\". Dabei ist eine Aufzinsung des Kapitals bis zum Renteneintritt in Höhe des Rechnungszinses anzunehmen.\"","v":"Beispiel: M(55) hat Vermögen in Höhe von 120.000 €. Aus diesem Vermögen kann ihm nach BGH 1.674 € monatliches Einkommen ab Renteneintritt (67) zugerechnet werden. Bei Annahme eines realistischen Rechnungszinses von 2% und der aktuellen Sterbetafeln jedoch nur 879 €. Dabei ist eine Aufzinsung des Kapitals bis zum Renteneintritt in Höhe des Rechnungszinses anzunehmen."}]
[null,"Vermögensverbrauchsrechner                                auf das",null,null,"Kindesleben","Elternleben"]
[null,"Höhe des einzusetzenden Vermögens:",null,null,{"v":120000,"d":"120,000.00 €"}]
[null,"Rechnungszins:",null,null,{"v":0.02,"d":"2.0%"}]
[null,"Alter d. unterhaltspflichtigen Kindes/Elternteils:",null,null,{"v":55,"d":"55.0"},79]
[null,"Renteneintrittsalter des Kindes:",null,null,66.5]
[null,"Geschlecht des Kindes (m/w):",null,null,"m","m"]
[null,"Das Kind ist bereits Rentner (j/n):",null,null,"n"]
[null,"Berechnung nach Tabelle d. BMF (ReZins 5,5%, Sterbetafel 2009/2011), BGH XII 150/10",{"$nulls":5},false]
[null,{"$f":"\"Rente ab möglichem verzehrenden Vermögenseinsatz (\"&TEXT(Rentenalter,\"##\")&\"):\"","v":"Rente ab möglichem verzehrenden Vermögenseinsatz (67):"},null,null,{"$f":"IF(E10=\"j\",+E5/12/VLOOKUP(E7,BMF_Barwerttabelle,IF(E9=\"m\",3,5)),-FV(5.5%,Rentenalter-E7,,E5)/12/VLOOKUP(E8,BMF_Barwerttabelle,IF(E9=\"m\",3,5)))","v":{"v":1673.889172620782,"d":"1,674 €"}},{"$f":"E5/12/VLOOKUP(F7,BMF_Barwerttabelle,IF(F9=\"m\",3,5))","v":{"v":1494.7683109118086,"d":"1,495 €"}}]
[null,"Lebenserwartung nach BMF-Tabelle",null,null,{"$f":"VLOOKUP(IF(E10=\"j\",E7,Rentenalter),BMF_Barwerttabelle,IF(E9=\"m\",2,4))","v":16.74},{"$f":"VLOOKUP(F7,BMF_Barwerttabelle,IF(F9=\"w\",5,3))","v":6.69}]
[null,{"$f":"\"Berechnung nach Verrentungssätzen mit Zinssatz \"&TEXT(E6,\"0,0%\")&\", aktuellste Sterbetafel, 5.Auflage Rn. 1129 \"","v":"Berechnung nach Verrentungssätzen mit Zinssatz 2,0%, aktuellste Sterbetafel, 5.Auflage Rn. 1129 "},{"$nulls":5},{"$f":"IF(E10=\"n\",-FV(E6,Rentenalter-E7,,E5),E5)","v":{"v":150689.57961437193,"d":"150,689.58 €"}}]
[null,{"$f":"\"Rente ab möglichem Vermögenseinsatz (\"&TEXT(Rentenalter,\"##\")&\")\"&\" Rechnungszins \"&TEXT(E6,\"#,00%\")&\":\"","v":"Rente ab möglichem Vermögenseinsatz (67) Rechnungszins 2,00%:"},null,null,{"$f":"-PMT(E6/12,E16*12,H14)","v":{"v":878.7009193479443,"d":"879 €"}},{"$f":"-PMT(E6/12,F16*12,E5)","v":{"v":1302.2607990041947,"d":"1,302 €"}}]
{"$rows_left_out":2}
{"sheet":"Rentenlücke","index":4,"n_rows":14,"n_cols":5,"rows_kept":14,"merged":[[0,1,0,5],[1,1,2,5],[3,1,3,5],[4,1,4,3],[4,4,4,5],[5,1,5,3],[5,4,5,5],[6,1,6,3],[6,4,6,5],[7,1,7,3],[7,4,7,5],[8,1,8,3],[8,4,8,5],[9,1,9,3],[9,4,9,5],[10,1,10,3],[10,4,10,5],[11,1,11,3],[11,4,11,5],[12,1,12,3],[12,4,12,5],[13,1,13,5]]}
[null,"Erforderliches Kapital zur Schließung einer Rentenlücke"]
[null,"Mit diesem Rechner kann das Kapital bestimmt werden, das im Alter x des unterhaltspflichtigen Kindes erforderlich ist, um im Renteneintrittsalter eine Versorgungslücke in Höhe von … € bei Annahme eines Renteneintrittsalters von … Jahren und einem Rechnungszins von ...% zu schließen."]
[]
[null,{"$f":"\"Beispiel: \"&TEXT(E8,\"##\")&\"(\"&TEXT(E6,\"##\")&\") hat voraussichtlich im Rentenalter von \"&TEXT(E7,\"##\")&\" Jahren gegenüber dem anzunehmenden angemessenen Eigenbedarf eine Alterseinkommenslücke von \"&TEXT(E5,\"##0,00 €\")&\": erforderliches Kapital im Alter \"&TEXT(E6,\"##\")&\" bei einem Rechnungszins von \"&TEXT(E9,\"#,##%\")&\": \"&TEXT(E12,\"###.##0,00 €\")","v":"Beispiel: m(55) hat voraussichtlich im Rentenalter von 67 Jahren gegenüber dem anzunehmenden angemessenen Eigenbedarf eine Alterseinkommenslücke von 900,00 €: erforderliches Kapital im Alter 55 bei einem Rechnungszins von 2,%: 116.333,49 €"}]
[null,"Rentenlücke",null,null,{"v":900,"d":"900.00 €"}]
[null,"Alter des unterhaltspflichtigen Kindes Kindes",null,null,55]
[null,"Renteneintrittsalter des unterhaltspflichtigen Kindes",null,null,67]
[null,"Geschlecht des Kindes (m/w)",null,null,"m"]
[null,"Rechnungszins",null,null,{"v":0.02,"d":"2%"}]
[null,"Voraussichtliche Bezugsdauer der Rente nach Sterbetafel",null,null,{"$f":"VLOOKUP(IF(E6>E7,E6,E7),IF(E8=\"m\",SterbetafelM,SterbetafelW),3)","v":{"v":16.115658392019856,"d":"16.12"}}]
[null,{"$f":"IF(E6>E7,\"\",\"Erforderliches Kapital im Rentenalter (\"&TEXT(E7,\"##\")&\")\")","v":"Erforderliches Kapital im Rentenalter (67)"},null,null,{"$f":"IF(E6>E7,\"\",ROUND(-PV(E9,E10,E5*12),0))","v":{"v":147539,"d":"147,539 €"}}]
[null,{"$f":"\"Erforderliches Kapital im Alter \"&TEXT(E6,\"##\")&\":\"","v":"Erforderliches Kapital im Alter 55:"},null,null,{"$f":"IF(E7>E6,-PV(E9,E7-E6,,E11),ROUND(-PV(E9,E10,E5*12),0))","v":{"v":116333.494632142,"d":"116,333 €"}}]
[null,{"$f":"\"mon. Rücklage zur Erzielung des Zielkapitals von \"&TEXT(E11,\"#.###.##0\")&\" in der Zeit zwischen dem \"&TEXT(E6,\"##\")&\". und dem \"&TEXT(E7,\"##\")&\". Lebensjahr\"","v":"mon. Rücklage zur Erzielung des Zielkapitals von 147.539 in der Zeit zwischen dem 55. und dem 67. Lebensjahr"},null,null,{"$f":"ROUND(-PMT(E9/12,(E7-E6)*12,,E11),0)","v":{"v":907,"d":"907 €"}}]
[null,"Nähere Hinweise in Hauß, Elternunterhalt, 5. Auflage Rn. 644 ff."]

{"sheet":"Korrektur der Altersvorsorge","index":5,"n_rows":59,"n_cols":24,"rows_kept":59,"merged":[[0,0,0,15],[1,0,1,15],[2,0,2,15],[3,0,4,15],[5,0,5,15],[6,0,6,15],[8,0,8,8],[8,9,14,9],[8,10,14,15],[9,8,17,8],[10,0,17,0],[10,1,17,1],[10,3,10,5],[13,2,14,2],[17,4,17,5],[19,0,24,0],[19,1,24,1],[19,2,19,7],[19,8,24,8],[19,9,24,9],[19,10,24,15],[22,2,23,2],[24,2,24,7],[26,0,34,0],[26,1,26,7],[26,9,34,9],[26,10,34,15],[27,1,27,6],[28,1,28,6],[29,1,29,6],[30,1,31,7],[32,1,32,6],[33,1,33,6],[34,1,34,6],[36,0,42,0],[36,1,36,7],[36,9,42,9],[36,10,42,15],[37,1,37,6],[38,1,38,6],[39,1,39,6],[40,1,40,6],[41,1,41,6],[42,1,42,6],[46,2,46,15]]}
["Kontrolle auf übermäßige Tilgung des Immobilienkredits"]
["Es können nur die weißen Felder ausgefüllt werden!"]
["1. Im ersten Schritt werden bezogen auf den Zeitpunkt der Inanspruchnahme auf Elternunterhalt Zins- und Tilgungsanteile des Kredits bezogen auf die jeweilige Periode der Inanspruchnahme ermittelt."]
["2. Im zweiten Schritt wird der Restkreditbetrag bis zur Regelaltersgrenze zu den Bedingungen des Ursprungsdarlehens neu (fiktiv) kreditiert und der notwendige Kapitaltilgungsanteil zur Tilgung des Kredits bis zur Regelaltersgrenze errechnet."]
[{"$nulls":17},2,208.33333333333334]
["3. Im dritten Schritt wird nach der pauschalen Berechnungsformel des BGH (FamRZ 2006, 1511) die monatliche Altersvorsorgerücklage errechnet"]
["4. Im vierten Schritt schließlich wird die Reduktion der monatlichen Altersvorsorgerücklage errechnet, die sich aus der Differenz der tatsächlichen Tilgungsrate für den Ursprungskredit ergibt und dem Kapitaltilgungsanteil des fiktiven Kredits ergibt."]
[]
["Ursprungsdarlehen der unterhaltspflichtigen Person",{"$nulls":8},"1.","Ein Immobilienkredit wird i.d.R. über einen bestimmten Kreditbetrag zu einem im Darlehensvertrag definierten Zinssatz und einer monatlichen Rate aufgenommen. Aus diesen Daten errechnet sich die Tilgungszeit des Kredits, bis dieser volständig abgelöst ist. Zinssatz, Jahresrate und Nettokreditbetrag müssen eingegeben werden.  Daüber hinaus muss angegeben werden, in welcher Zahlungsperiode (x-ten Jahr) des Kredits die Berechnung erfolgt.\nFalls ein Kredit berechnet werden soll, der zu einem festen Zinssatz innerhalb einer festen Laufzeit vollständig getilgt werden soll, wird die jährliche Rate als 'notwendige Rate' angegeben und müsste von Ihnen ggfls alternativ aus dem Kreditvertrag ausgelesen werden.",{"$nulls":6},{"$f":"+F13*D13","v":-14527.469923512608}]
["Gebdatum d. Pflichtigen:",null,null,"1980-01-01","Berechnungsdatum",{"$f":"TODAY()","v":"2019-03-18"},"Kreditaufnahme am:","2010-01-01",{"$nulls":9},"Monatsbasis",true]
["1.",null,"Bank","Sparkasse Duisburg",null,null,"Zinsbindung bis:","2030-01-01",{"$nulls":9},{"$f":"+F13/12","v":1.2106224936260508},{"$f":"IF(Monatsbasis,12,1)","v":{"$error":"#REF!"}}]
[null,null,"Zinssatz","Monatsrate","Kreditbetrag","Tilgungszeit","Enddatum","im xten Jahr",{"$nulls":13},2002,{"v":54000,"d":"54,000.00 €"},{"v":45000,"d":"45,000.00 €"}]
[null,null,{"v":0.02,"d":"2.000%"},{"v":-1000,"d":"-1,000.00 €"},{"v":150000,"d":"150,000.00 €"},{"$f":"NPER(AVV_Zinssatz,AVV_Monatsrate*12,AVV_Kreditbetrag,0,0)","v":{"v":14.527469923512609,"d":"14.53"}},{"$f":"IFERROR(DATE(YEAR(AVV_Kreditaufnahme),MONTH(AVV_Kreditaufnahme)+AVV_Tilgungszeit*12,DAY(AVV_Kreditaufnahme)),\"\")","v":"2024-07-01"},{"$f":"YEARFRAC(AVV_Kreditaufnahme,Berechnungsdatum,3)","v":{"v":9.213698630136987,"d":"9"}},{"$nulls":9},{"$f":"+D13*F13","v":-14527.469923512608},{"$nulls":3},2003,{"v":61200,"d":"61,200.00 €"},{"v":51000,"d":"51,000.00 €"}]
[null,null,{"$f":"\"in Rate \"&TEXT(H13,\"##\")","v":"in Rate 9"},"Kapitaltilgung","Zinstilgung","Kapitaltilgung","Restdarlehen","tatsächliche Rate",{"$nulls":13},2004,{"v":61800,"d":"61,800.00 €"},{"v":52200,"d":"52,200.00 €"}]
[{"$nulls":3},{"$f":"IFERROR(PPMT(C13,H13,AVV_Tilgungszeit,AVV_Kreditbetrag,0,0),\"\")","v":{"v":-10589.652975819457,"d":"-10,589.65 €"}},{"$f":"IFERROR(IPMT(C13,H13,AVV_Tilgungszeit,AVV_Kreditbetrag,0,0),\"\")","v":{"v":-1410.3470241805564,"d":"-1,410.35 €"}},{"$f":"IFERROR(-CUMPRINC(C13,AVV_Tilgungszeit,AVV_Kreditbetrag,1,H13,0),\"\")","v":{"v":87791.65588004005,"d":"87,791.66 €"}},{"$f":"IFERROR(IF(SUM(C13:H13)=0,0,+E13-F15),\"\")","v":{"v":62208.34411995995,"d":"62,208.34 €"}},{"$f":"-AVVKorrektur_Tilgung-E15","v":{"v":12000.000000000015,"d":"12,000.00 €"}},{"$nulls":9},"BeamterAVV",2,null,null,2005,{"v":62400,"d":"62,400.00 €"},{"v":52800,"d":"52,800.00 €"}]
{"$rows_left_out":45}
{"sheet":"Parametereinstellung","index":6,"n_rows":27,"n_cols":5,"rows_kept":27}
[]
[]
[]
[]
["Parametereingabe 2016","Pflichtiger","Partner"]
["Selbstbehalt",{"v":1800,"d":"1,800.00 €"},{"$f":"1800*2*0.9-1800","v":{"v":1440,"d":"1,440.00 €"}}]
["im Selbstbehalt enthaltene Warmmietkosten",{"v":480,"d":"480.00 €"},{"v":380,"d":"380.00 €"}]
["Quote des Quotenunterhaltes"]
["Zeitraum","von","2004-10-01",null,{"$f":"DATE(YEAR(C9),MONTH(C9)+1,0)","v":"2004-10-31"}]
[null,"bis","2005-06-30"]
[null,"Monate",{"$f":"+MONTH(C10)+IF(DAY(C9)=1,1,0)-MONTH(C9)+IF(YEAR(C9)<YEAR(C10),12,0)","v":{"v":9,"d":"9 "}}]
[null,"Tage",{"$f":"IF(DAY(C9)>1,+DAY(E9)-DAY(C9)+1,0)","v":{"v":0,"d":"0.00"}}]
[null,"West","Ost"]
["monatliche Beitragsbemessungsgrenze",{"$f":"77400/12","v":{"v":6450,"d":"6,450.00 €"}},{"$f":"64800/12","v":{"v":5400,"d":"5,400.00"}}]
[]
{"$rows_left_out":13}
{"sheet":"BMF-Tabelle","index":7,"n_rows":103,"n_cols":8,"rows_kept":103,"hidden":true}
["Alter","Lebens-erwartung","Kapitalwert","Lebens-erwartung","Kapitalwert"]
[]
[0,77.72,18.391,82.73,18.459]
[1,77.02,18.379,81.99,18.45]
[2,76.04,18.363,81.01,18.438]
[3,75.06,18.346,80.02,18.424]
[4,74.07,18.328,79.03,18.41]
[5,73.08,18.308,78.04,18.396]
[6,72.09,18.288,77.05,18.38]
[7,71.09,18.266,76.05,18.363]
[8,70.1,18.244,75.06,18.346]
[9,69.11,18.22,74.06,18.328]
[10,68.11,18.195,73.07,18.308]
[11,67.12,18.168,72.08,18.288]
[12,66.12,18.14,71.08,18.266]
{"$rows_left_out":89}
{"sheet":"Sterbetafel","index":8,"n_rows":113,"n_cols":13,"rows_kept":113,"hidden":true,"merged":[[0,0,1,5],[0,7,1,12],[2,0,2,5],[2,7,2,12],[3,0,3,5],[3,7,3,12],[4,0,4,5],[4,7,4,12],[5,0,10,0],[5,1,9,1],[5,2,9,2],[5,3,10,3],[5,4,9,4],[5,5,9,5],[5,7,10,7],[5,8,9,8],[5,9,9,9],[5,10,10,10],[5,11,9,11],[5,12,9,12]]}
["Periodensterbetafel 2009 / 2011",{"$nulls":6},{"$f":"+A1","v":"Periodensterbetafel 2009 / 2011"}]
[]
["Deutschland",{"$nulls":6},"Deutschland"]
["Männer",{"$nulls":6},"Frauen"]
["Quelle, Statistisches Bundesamt",{"$nulls":6},"Quelle, Statistisches Bundesamt"]
["Vollendetes Alter","Überlebende im Alter x","Durchschn. Lebenserwartung im Alter x","Vollendetes Alter","Überlebende im Alter x","Durchschn. Lebenserwartung im Alter x",null,"Vollendetes Alter","Überlebende im Alter x","Durchschn. Lebenserwartung im Alter x","Vollendetes Alter","Überlebende im Alter x","Durchschn. Lebenserwartung im Alter x"]
[null,"Überlebende","Durchschnittliche ",null,"Überlebende","Durchschnittliche ",null,null,"Überlebende","Durchschnittliche ",null,"Überlebende","Durchschnittliche "]
[null,"im Alter x","Lebenserwartung",null,"im Alter x","Lebenserwartung",null,null,"im Alter x","Lebenserwartung",null,"im Alter x","Lebenserwartung"]
[null,null,"im Alter x",null,null,"im Alter x",{"$nulls":3},"im Alter x",null,null,"im Alter x"]
[null,null,"in Jahren",null,null,"in Jahren",{"$nulls":3},"in Jahren",null,null,"in Jahren"]
[null,"l x"," e x",null,"l x"," e x",null,null,"l x"," e x",null,"l x"," e x"]
[]
[null,100000,{"v":77.97088113486463,"d":"77.97"},{"$nulls":4},0,100000,{"v":82.72548871066736,"d":"82.73"}]
[1,{"v":99599.67671123307,"d":"99600"},{"v":77.28365320481048,"d":"77.28"},51,{"$f":"+B64","v":{"v":95512.85320451939,"d":"95513"}},{"$f":"+C64","v":{"v":28.98236712853949,"d":"28.98"}},null,1,{"v":99684.73133043556,"d":"99685"},{"v":81.98660191751593,"d":"81.99"},51,{"$f":"+I64","v":{"v":97323.55387431894,"d":"97324"}},{"$f":"+J64","v":{"v":33.05513440168644,"d":"33.06"}}]
[2,{"v":99566.95056054794,"d":"99567"},{"v":76.30889083025535,"d":"76.31"},52,{"$f":"+B65","v":{"v":95086.42346465052,"d":"95086"}},{"v":28.1101006993577,"d":"28.11"},null,2,{"v":99658.4180843378,"d":"99658"},{"v":81.00811717986046,"d":"81.01"},52,{"$f":"+I65","v":{"v":97085.42319282219,"d":"97085"}},{"v":32.13498548629154,"d":"32.13"}]
{"$rows_left_out":98}